{"text_format":"1","workbook":"xlsx","n_sheets":7,"sheets":["INSTRUCTIONS","NOMS DES PROJETS","ANALYSE","APERÇU","RÉSULTATS ET PLAN","RÉSULTATS ORG.","ARGUMENTAIRE"],"not_rendered":{"charts":4,"images":5,"macros":1,"external_links":0,"defined_names":0,"comments":2,"pivot_tables":0},"unopened":[],"bounds":{"document_bytes":16777216,"sheet_cells":100000,"rows_first":2000,"rows_last":500,"rows_between":2000,"halvings":0,"cell_chars":16384,"cell_head_chars":4096},"cells_cut":0,"cells_raw":0,"read":"whole","date_system":"1900"}

{"sheet":"INSTRUCTIONS","index":0,"n_rows":91,"n_cols":1,"rows_kept":91,"cut":false,"hidden":false,"merged":[]}
[]
[]
[]
[]
[]
[]
[]
[]
[]
[]
[]
[]
[]
[]
[]
[]
[]
[]
[]
[]
{"$rows_left_out":72}
{"sheet":"NOMS DES PROJETS","index":1,"n_rows":17,"n_cols":3,"rows_kept":17,"cut":false,"hidden":false,"merged":[[15,3,15,7],[16,3,16,7],[2,3,2,7],[3,3,3,7],[4,3,4,7],[5,3,5,7],[6,3,6,7],[12,3,12,7],[7,3,7,7],[8,3,8,7],[9,3,9,7],[10,3,10,7],[11,3,11,7],[13,3,13,7],[14,3,14,7]]}
["ÉTAPE 1 - INSCRIRE LE NOM DES PROJETS À ANALYSER"]
[]
[null,1,"Nom du projet "]
[null,2,"Nom du projet "]
[null,3,"Nom du projet "]
[null,4,"Nom du projet "]
[null,5,"Nom du projet "]
[null,6,"Nom du projet "]
[null,7,"Nom du projet "]
[null,8,"Nom du projet "]
[null,9,"Nom du projet "]
[null,10,"Nom du projet "]
[null,11,"Nom du projet "]
[null,12,"Nom du projet "]
[null,13,"Nom du projet "]
[null,14,"Nom du projet "]
[null,15,"Nom du projet "]

{"sheet":"ANALYSE","index":2,"n_rows":35,"n_cols":22,"rows_kept":35,"cut":false,"hidden":false,"merged":[[11,2,12,2],[15,0,17,1],[11,5,12,19],[11,3,13,4],[0,0,0,19],[11,0,14,1],[13,19,14,19],[13,10,14,10],[13,11,14,11],[13,9,14,9],[13,5,14,5],[13,12,14,12],[13,13,14,13],[13,14,14,14],[13,6,14,6],[13,7,14,7],[22,0,26,1],[13,15,14,15],[13,16,14,16],[13,17,14,17],[13,18,14,18],[22,2,26,2],[18,0,21,1],[13,8,14,8]]}
["ÉTAPE 2-ANALYSER LES PROJETS"]
[]
[]
[]
[]
[]
[]
[]
[]
[]
[]
["CLÉS",null,"Pondération","ÉVALUER LES ÉLÉMENTS DE PRIORISATION",null,"ANALYSE\n5=Tout à fait d'accord, 4=D'accord, 3=Ni en accord, ni en désaccord, 2=Plutôt en désaccord, 1=Tout à fait en désaccord"]
[]
[null,null,"Total",null,null,{"$f":"'NOMS DES PROJETS'!D3","v":0},{"$f":"'NOMS DES PROJETS'!D4","v":0},{"$f":"'NOMS DES PROJETS'!D5","v":0},{"$f":"'NOMS DES PROJETS'!D6","v":0},{"$f":"'NOMS DES PROJETS'!D7","v":0},{"$f":"'NOMS DES PROJETS'!D8","v":0},{"$f":"'NOMS DES PROJETS'!D9","v":0},{"$f":"'NOMS DES PROJETS'!D10","v":0},{"$f":"'NOMS DES PROJETS'!D11","v":0},{"$f":"'NOMS DES PROJETS'!D12","v":0},{"$f":"'NOMS DES PROJETS'!D13","v":0},{"$f":"'NOMS DES PROJETS'!D14","v":0},{"$f":"'NOMS DES PROJETS'!D15","v":0},{"$f":"'NOMS DES PROJETS'!D16","v":0},{"$f":"'NOMS DES PROJETS'!D17","v":0}]
[null,null,{"$f":"SUM(C16:C27)","v":100},"Le projet:","Élément de soutien à la discussion",null,"=C5","=C5","=C5","=C5",null,null,null,"=C5","=C5"]
["VISION ET COHÉRENCE",null,20,"1-Est une obligation du MSSS","Le projet correspond à une priorité du MSSS. Le projet est en accord avec les directives ministérielles.",null,null,null,null,null,null,null,null,null,null,null,null,null,null,null,{"$f":"SUM(F16:T16)","v":0}]
[null,null,10,"2-Est en droite ligne avec la vision actuelle et à long terme de l'organisation\n\n","Le projet est aligné avec les stratégies et les valeurs organisationnelles ou la planification stratégique ministérielle. Le projet s'inscrit dans la vision de la direction, est dans la continuité des pratiques existantes.\nLe projet positionne adéquatement l'organisation au sein du RSSS et de la communauté et les parties prenantes internes et externes ont été impliquées dans la réflexion et y adhèrent.\n",null,null,null,null,null,null,null,null,null,null,null,null,null,null,null,{"$f":"SUM(F17:T17)","v":0}]
[null,null,10,"3-Est lié à un problème documenté et reconnu, a un objectif clair\n\n","Le projet est issu de besoins documentés et validés auprès des parties prenantes. Un état de situation sommaire ou un portrait ont été réalisés. Le résultat souhaité est clairement défini.",null,null,null,null,null,null,null,null,null,null,null,null,null,null,null,0,{"$f":"AVERAGE(U16:U18)","v":0}]
["EFFETS",null,20,"4- Exige une attention immédiate et une forte mobilisation. Le statu quo n'est pas possible.\n\n","Le projet veut prévenir des risques imminents graves, probables ou critiques ou répondre à des obligations légales ou de conformité. Le statu quo n'est pas une option acceptable.",null,null,null,null,null,null,null,null,null,null,null,null,null,null,null,0]
[null,null,10,"5- Prévoit des retombées significatives pour les usagers et leurs proches\n","Par exemple, le projet favorise un accès équitable, améliore la qualité des services, diminue le temps d'attente, facilite l'accès équitable et optimisé aux ressources, notamment en facilitant l'accès à des services au moment et à l'endroit opportuns.",null,null,null,null,null,null,null,null,null,null,null,null,null,null,null,0]
{"$rows_left_out":16}
{"sheet":"APERÇU","index":3,"n_rows":21,"n_cols":6,"rows_kept":21,"cut":false,"hidden":false,"merged":[[0,2,0,13]]}
[null,null,"APERÇU GÉNÉRAL DES PROJETS \nVisualisez ici, en un seul coup d’œil, les projets les plus prioritaires et les plus susceptibles de se conclure par un succès"]
[]
[]
[]
[]
[null,null,"NOM","TOTAUX","Notez que: "]
[null,null,{"$f":"'NOMS DES PROJETS'!D4","v":0},{"$f":"ANALYSE!G30","v":0},{"$f":"IF(ANALYSE!G19<4,\" \",\"Ce projet exige une attention immédiate\")","v":" "},{"$f":"IF(ANALYSE!G16<4,\" \",\"Ce projet est une obligation du MSSS\")","v":" "}]
[null,null,{"$f":"'NOMS DES PROJETS'!D10","v":0},{"$f":"ANALYSE!M30","v":0},{"$f":"IF(ANALYSE!M19<4,\" \",\"Ce projet exige une attention immédiate\")","v":" "},{"$f":"IF(ANALYSE!M16<4,\" \",\"Ce projet est une obligation du MSSS\")","v":" "}]
[null,null,{"$f":"'NOMS DES PROJETS'!D16","v":0},{"$f":"ANALYSE!S30","v":0},{"$f":"IF(ANALYSE!S19<4,\" \",\"Ce projet exige une attention immédiate\")","v":" "},{"$f":"IF(ANALYSE!S16<4,\" \",\"Ce projet est une obligation du MSSS\")","v":" "}]
[null,null,{"$f":"'NOMS DES PROJETS'!D9","v":0},{"$f":"ANALYSE!L30","v":0},{"$f":"IF(ANALYSE!L19<4,\" \",\"Ce projet exige une attention immédiate\")","v":" "},{"$f":"IF(ANALYSE!L16<4,\" \",\"Ce projet est une obligation du MSSS\")","v":" "}]
[null,null,{"$f":"'NOMS DES PROJETS'!D8","v":0},{"$f":"ANALYSE!K30","v":0},{"$f":"IF(ANALYSE!K19<4,\" \",\"Ce projet exige une attention immédiate\")","v":" "},{"$f":"IF(ANALYSE!K16<4,\" \",\"Ce projet est une obligation du MSSS\")","v":" "}]
[null,null,{"$f":"'NOMS DES PROJETS'!D15","v":0},{"$f":"ANALYSE!R30","v":0},{"$f":"IF(ANALYSE!R30<4,\" \",\"Ce projet exige une attention immédiate\")","v":" "},{"$f":"IF(ANALYSE!R16<4,\" \",\"Ce projet est une obligation du MSSS\")","v":" "}]
[null,null,{"$f":"'NOMS DES PROJETS'!D5","v":0},{"$f":"ANALYSE!H30","v":0},{"$f":"IF(ANALYSE!H19<4,\" \",\"Ce projet exige une attention immédiate\")","v":" "},{"$f":"IF(ANALYSE!H16<4,\" \",\"Ce projet est une obligation du MSSS\")","v":" "}]
[null,null,{"$f":"'NOMS DES PROJETS'!D6","v":0},{"$f":"ANALYSE!I30","v":0},{"$f":"IF(ANALYSE!I19<4,\" \",\"Ce projet exige une attention immédiate\")","v":" "},{"$f":"IF(ANALYSE!I16<4,\" \",\"Ce projet est une obligation du MSSS\")","v":" "}]
[null,null,{"$f":"'NOMS DES PROJETS'!D7","v":0},{"$f":"ANALYSE!J30","v":0},{"$f":"IF(ANALYSE!J19<4,\" \",\"Ce projet exige une attention immédiate\")","v":" "},{"$f":"IF(ANALYSE!J16<4,\" \",\"Ce projet est une obligation du MSSS\")","v":" "}]
[null,null,{"$f":"'NOMS DES PROJETS'!D17","v":0},{"$f":"ANALYSE!T30","v":0},{"$f":"IF(ANALYSE!T19<4,\" \",\"Ce projet exige une attention immédiate\")","v":" "},{"$f":"IF(ANALYSE!T16<4,\" \",\"Ce projet est une obligation du MSSS\")","v":" "}]
[null,null,{"$f":"'NOMS DES PROJETS'!D3","v":0},{"$f":"ANALYSE!F30","v":0},{"$f":"IF(ANALYSE!F19<4,\" \",\"Ce projet exige une attention immédiate\")","v":" "},{"$f":"IF(ANALYSE!F16<4,\" \",\"Ce projet est une obligation du MSSS\")","v":" "}]
[null,null,{"$f":"'NOMS DES PROJETS'!D12","v":0},{"$f":"ANALYSE!O30","v":0},{"$f":"IF(ANALYSE!O19<4,\" \",\"Ce projet exige une attention immédiate\")","v":" "},{"$f":"IF(ANALYSE!O16<4,\" \",\"Ce projet est une obligation du MSSS\")","v":" "}]
[null,null,{"$f":"'NOMS DES PROJETS'!D14","v":0},{"$f":"ANALYSE!Q30","v":0},{"$f":"IF(ANALYSE!Q19<4,\" \",\"Ce projet exige une attention immédiate\")","v":" "},{"$f":"IF(ANALYSE!Q16<4,\" \",\"Ce projet est une obligation du MSSS\")","v":" "}]
[null,null,{"$f":"'NOMS DES PROJETS'!D11","v":0},{"$f":"ANALYSE!N30","v":0},{"$f":"IF(ANALYSE!N19<4,\" \",\"Ce projet exige une attention immédiate\")","v":" "},{"$f":"IF(ANALYSE!N16<4,\" \",\"Ce projet est une obligation du MSSS\")","v":" "}]
{"$rows_left_out":2}
{"sheet":"RÉSULTATS ET PLAN","index":4,"n_rows":169,"n_cols":17,"rows_kept":169,"cut":false,"hidden":false,"merged":[[0,0,0,16],[142,3,146,3],[142,2,146,2],[153,3,157,3],[153,2,157,2],[164,3,168,3],[164,2,168,2],[109,3,113,3],[109,2,113,2],[120,3,124,3],[120,2,124,2],[131,3,135,3],[131,2,135,2],[3,2,3,4],[4,0,14,0],[4,1,14,1],[4,2,5,2],[4,3,5,3],[6,3,9,3],[6,2,9,2],[10,2,14,2],[10,3,14,3],[17,3,20,3],[17,2,20,2],[15,0,25,0],[15,1,25,1],[26,0,36,0],[26,1,36,1],[26,2,27,2],[26,3,27,3],[21,3,25,3],[21,2,25,2],[32,3,36,3],[32,2,36,2],[15,2,16,2],[15,3,16,3],[28,2,31,2],[28,3,31,3],[48,0,58,0],[48,1,58,1],[50,3,53,3],[50,2,53,2],[37,0,47,0],[37,1,47,1],[48,2,49,2],[48,3,49,3],[39,2,42,2],[39,3,42,3],[37,2,38,2],[37,3,38,3],[43,3,47,3],[43,2,47,2],[54,3,58,3],[54,2,58,2],[59,0,69,0],[59,1,69,1],[116,2,119,2],[116,3,119,3],[125,0,135,0],[125,1,135,1],[70,0,80,0],[70,1,80,1],[103,0,113,0],[103,1,113,1],[81,2,82,2],[81,3,82,3],[81,0,91,0],[81,1,91,1],[83,3,86,3],[83,2,86,2],[103,3,104,3],[70,2,71,2],[70,3,71,3],[59,2,60,2],[59,3,60,3],[61,3,64,3],[61,2,64,2],[65,3,69,3],[125,2,126,2],[125,3,126,3],[127,2,130,2],[127,3,130,3],[92,0,102,0],[92,1,102,1],[114,0,124,0],[114,1,124,1],[114,2,115,2],[103,2,104,2],[114,3,115,3],[98,3,102,3],[98,2,102,2],[92,2,93,2],[92,3,93,3],[94,3,97,3],[94,2,97,2],[72,3,75,3],[72,2,75,2],[105,3,108,3],[105,2,108,2],[65,2,69,2],[76,3,80,3],[76,2,80,2],[87,3,91,3],[87,2,91,2],[136,3,137,3],[138,2,141,2],[138,3,141,3],[158,0,168,0],[158,1,168,1],[158,2,159,2],[158,3,159,3],[160,2,163,2],[160,3,163,3],[147,2,148,2],[147,3,148,3],[149,2,152,2],[149,3,152,3],[147,0,157,0],[147,1,157,1],[136,0,146,0],[136,1,146,1],[136,2,137,2]]}
["PLAN DE MISE EN PLACE DES ÉLÉMENTS À DÉVELOPPER POUR FAVORISER LE SUCCÈS DES PROJETS SÉLECTIONNÉS"]
["Retrouvez ici les critères moins bien cotés dans le projet. Utilisez la colonne G pour décrire les actions à mener en priorité afin d'augmenter la viabilité ou la pertinence des projets priorisés"]
[]
["Nom de projet ","Moyenne des clés","Clés",null,null,"Éléments à développer ","Moyens envisagés pour développer les clés","RESPONSABLE","COLLABORATEUR","INDICATEUR DE RÉUSSITE","ÉCHÉANCE","0%","25%","50%","75%","100%","Suivi et preuves d'avancement de la tâche"]
[{"$f":"ANALYSE!F14","v":0},{"$f":"ANALYSE!F30","v":0},"Vision et cohérence",{"$f":"ANALYSE!F33","v":{"$error":"#DIV/0!"}},null,{"$f":"IF(ANALYSE!F17<3,ANALYSE!D17,0)","v":"2-Est en droite ligne avec la vision actuelle et à long terme de l'organisation\n\n"}]
[null,null,null,null,null,{"$f":"IF(ANALYSE!F18<3,ANALYSE!D18,0)","v":"3-Est lié à un problème documenté et reconnu, a un objectif clair\n\n"}]
[null,null,"Effets",{"$f":"ANALYSE!F34","v":{"$error":"#DIV/0!"}},null,{"$f":"IF(ANALYSE!F19<3,ANALYSE!D19,0)","v":"4- Exige une attention immédiate et une forte mobilisation. Le statu quo n'est pas possible.\n\n"}]
[null,null,null,null,null,{"$f":"IF(ANALYSE!F20<3,ANALYSE!D20,0)","v":"5- Prévoit des retombées significatives pour les usagers et leurs proches\n"}]
[null,null,null,null,null,{"$f":"IF(ANALYSE!F21<3,ANALYSE!D21,0)","v":"6- Prévoit des retombées significatives pour l'organisation\n\n"}]
[null,null,null,null,null,{"$f":"IF(ANALYSE!F22<3,ANALYSE!D22,0)","v":"7- Améliorera le vivre-ensemble de l'organisation\n\n"}]
[null,null,"Capacité de l'organisation",{"$f":"ANALYSE!F35","v":{"$error":"#DIV/0!"}},null,{"$f":"IF(ANALYSE!F23<3,ANALYSE!E23,0)","v":"Une direction a l'intérêt et la capacité à jouer le rôle de porteur du projet et de le pérenniser dans les opérations courantes. \n"}]
[null,null,null,null,null,{"$f":"IF(ANALYSE!F24<3,ANALYSE!E24,0)","v":"Les directions collaboratrices ont l'intérêt et la capacité de contribuer au succès de ce projet.\n"}]
[null,null,null,null,null,{"$f":"IF(ANALYSE!F25<3,ANALYSE!E25,0)","v":"Le projet est en accord avec les meilleures connaissances. Le projet est éthique, sécuritaire, socialement acceptable et est en accord avec les lois et les règlements."}]
[null,null,null,null,null,{"$f":"IF(ANALYSE!F26<3,ANALYSE!E26,0)","v":"Le projet dispose déjà des ressources financières, humaines et matérielles appropriées.\n"}]
[null,null,null,null,null,{"$f":"IF(ANALYSE!F27<3,ANALYSE!E27,0)","v":"Le moment semble propice pour amorcer le projet.\n"}]
[{"$f":"ANALYSE!G14","v":0},{"$f":"ANALYSE!G30","v":0},"Vision et cohérence",{"$f":"AVERAGE(ANALYSE!G17:G18)","v":{"$error":"#DIV/0!"}},null,{"$f":"IF(ANALYSE!G17<3,ANALYSE!D17,0)","v":"2-Est en droite ligne avec la vision actuelle et à long terme de l'organisation\n\n"}]
[null,null,null,null,null,{"$f":"IF(ANALYSE!G18<3,ANALYSE!D18,0)","v":"3-Est lié à un problème documenté et reconnu, a un objectif clair\n\n"}]
[null,null,"Effets",{"$f":"AVERAGE(ANALYSE!G19:G22)","v":{"$error":"#DIV/0!"}},null,{"$f":"IF(ANALYSE!G19<3,ANALYSE!D19,0)","v":"4- Exige une attention immédiate et une forte mobilisation. Le statu quo n'est pas possible.\n\n"}]
[null,null,null,null,null,{"$f":"IF(ANALYSE!G20<3,ANALYSE!D20,0)","v":"5- Prévoit des retombées significatives pour les usagers et leurs proches\n"}]
[null,null,null,null,null,{"$f":"IF(ANALYSE!G21<3,ANALYSE!D21,0)","v":"6- Prévoit des retombées significatives pour l'organisation\n\n"}]
{"$rows_left_out":150}
{"sheet":"RÉSULTATS ORG.","index":5,"n_rows":11,"n_cols":13,"rows_kept":11,"cut":false,"hidden":false,"merged":[[0,0,0,12],[2,2,2,6],[2,8,2,12]]}
["CONSIDÉRER LES RÉSULTATS TOTAUX POUR L'ORGANISATION"]
[]
[null,null,"CLÉS DE PRIORISATION GÉNÉRALES",null,null,null,null,null,"ÉLÉMENTS DE PRIORISATION DÉTAILLÉS"]
[null,null,"VISION ET COHÉRENCE",null,null,null,{"$f":"ANALYSE!V18","v":0},null,"Est une solution à un problème documenté",null,null,null,{"$f":"ANALYSE!U18","v":0}]
[null,null,"EFFETS",null,null,null,{"$f":"ANALYSE!V22","v":0},null,"Prévoit des retombées significatives pour les usagers",null,null,null,{"$f":"ANALYSE!U20","v":0}]
[null,null,"CAPACITÉ DE L'ORGANISATION",null,null,null,{"$f":"ANALYSE!V27","v":0},null,"Est une obligation du MSSS",null,null,null,{"$f":"ANALYSE!U16","v":0}]
[null,null,null,null,null,null,null,null,"Répondra à un problème urgent",null,null,null,{"$f":"ANALYSE!U19","v":0}]
[null,null,null,null,null,null,null,null,"Possède un potentiel initial de succès",null,null,null,{"$f":"ANALYSE!V27","v":0}]
[null,null,null,null,null,null,null,null,"Prévoit des retombées significatives pour l'organisation",null,null,null,{"$f":"ANALYSE!U21","v":0}]
[null,null,null,null,null,null,null,null,"Est aligné avec la vision de l'organisation",null,null,null,{"$f":"ANALYSE!U17","v":0}]
[null,null,null,null,null,null,null,null,"Améliorera le vivre-ensemble de l'organisation",null,null,null,{"$f":"ANALYSE!U22","v":0}]

{"sheet":"ARGUMENTAIRE","index":6,"n_rows":14,"n_cols":31,"rows_kept":14,"cut":false,"hidden":false,"merged":[[0,0,0,22]]}
["ARGUMENTAIRE POUR LES COTES ATTRIBUÉES AUX PROJETS"]
[]
["Consignez ici les raisons expliquant les cotes attribuées à chacun des projets (facultatif). Si la cotation est effectuée en rencontre, il peut être facilitant de demander à une personne de remplir cet onglet dans un second document."]
[]
[null,null,{"$f":"ANALYSE!F14","v":0},null,{"$f":"ANALYSE!G14","v":0},null,{"$f":"ANALYSE!H14","v":0},null,{"$f":"ANALYSE!I14","v":0},null,{"$f":"ANALYSE!J14","v":0},null,{"$f":"ANALYSE!K14","v":0},null,{"$f":"ANALYSE!L14","v":0},null,{"$f":"ANALYSE!M14","v":0},null,{"$f":"ANALYSE!N14","v":0},null,{"$f":"ANALYSE!O14","v":0},null,{"$f":"ANALYSE!P14","v":0},null,{"$f":"ANALYSE!Q14","v":0},null,{"$f":"ANALYSE!R14","v":0},null,{"$f":"ANALYSE!S14","v":0},null,{"$f":"ANALYSE!T14","v":0}]
[null,"Cote","Argumentaire: ","Cote","Argumentaire:","Cote","Argumentaire:","Cote","Argumentaire:","Cote","Argumentaire:","Cote","Argumentaire:","Cote","Argumentaire:","Cote","Argumentaire:","Cote","Argumentaire:","Cote","Argumentaire:","Cote","Argumentaire:","Cote","Argumentaire:","Cote","Argumentaire:","Cote","Argumentaire:","Cote","Argumentaire:"]
["1- Est en droite ligne avec la vision actuelle et à long terme de l'organisation\n",{"$f":"ANALYSE!F16","v":0},null,{"$f":"ANALYSE!G17","v":0},null,{"$f":"ANALYSE!H17","v":0},null,{"$f":"ANALYSE!I17","v":0},null,{"$f":"ANALYSE!J17","v":0},null,{"$f":"ANALYSE!K17","v":0},null,{"$f":"ANALYSE!L17","v":0},null,{"$f":"ANALYSE!M17","v":0},null,{"$f":"ANALYSE!N17","v":0},null,{"$f":"ANALYSE!O17","v":0},null,{"$f":"ANALYSE!P17","v":0},null,{"$f":"ANALYSE!Q17","v":0},null,{"$f":"ANALYSE!R17","v":0},null,{"$f":"ANALYSE!S17","v":0},null,{"$f":"ANALYSE!T17","v":0}]
["2- Offrira une solution à un problème documenté et à un objectif défini, répondra à des besoins d'acteurs internes ou externes\n\n",{"$f":"ANALYSE!F17","v":0},null,{"$f":"ANALYSE!G18","v":0},null,{"$f":"ANALYSE!H18","v":0},null,{"$f":"ANALYSE!I18","v":0},null,{"$f":"ANALYSE!J18","v":0},null,{"$f":"ANALYSE!K18","v":0},null,{"$f":"ANALYSE!L18","v":0},null,{"$f":"ANALYSE!M18","v":0},null,{"$f":"ANALYSE!N18","v":0},null,{"$f":"ANALYSE!O18","v":0},null,{"$f":"ANALYSE!P18","v":0},null,{"$f":"ANALYSE!Q18","v":0},null,{"$f":"ANALYSE!R18","v":0},null,{"$f":"ANALYSE!S18","v":0},null,{"$f":"ANALYSE!T18","v":0}]
["3- Répondra à un problème urgent qui exige une attention immédiate et une forte mobilisation\n\n",{"$f":"ANALYSE!F18","v":0},null,{"$f":"ANALYSE!G19","v":0},null,{"$f":"ANALYSE!H19","v":0},null,{"$f":"ANALYSE!I19","v":0},null,{"$f":"ANALYSE!J19","v":0},null,{"$f":"ANALYSE!K19","v":0},null,{"$f":"ANALYSE!L19","v":0},null,{"$f":"ANALYSE!M19","v":0},null,{"$f":"ANALYSE!N19","v":0},null,{"$f":"ANALYSE!O19","v":0},null,{"$f":"ANALYSE!P19","v":0},null,{"$f":"ANALYSE!Q19","v":0},null,{"$f":"ANALYSE!R19","v":0},null,{"$f":"ANALYSE!S19","v":0},null,{"$f":"ANALYSE!T19","v":0}]
["4- Prévoit des retombées significatives pour les usagers et leurs proches\n",{"$f":"ANALYSE!F19","v":0},null,{"$f":"ANALYSE!G20","v":0},null,{"$f":"ANALYSE!H20","v":0},null,{"$f":"ANALYSE!I20","v":0},null,{"$f":"ANALYSE!J20","v":0},null,{"$f":"ANALYSE!K20","v":0},null,{"$f":"ANALYSE!L20","v":0},null,{"$f":"ANALYSE!M20","v":0},null,{"$f":"ANALYSE!N20","v":0},null,{"$f":"ANALYSE!O20","v":0},null,{"$f":"ANALYSE!P20","v":0},null,{"$f":"ANALYSE!Q20","v":0},null,{"$f":"ANALYSE!R20","v":0},null,{"$f":"ANALYSE!S20","v":0},null,{"$f":"ANALYSE!T20","v":0}]
["5- Prévoit des retombées significatives pour l'organisation\n\n",{"$f":"ANALYSE!F20","v":0},null,{"$f":"ANALYSE!G21","v":0},null,{"$f":"ANALYSE!H21","v":0},null,{"$f":"ANALYSE!I21","v":0},null,{"$f":"ANALYSE!J21","v":0},null,{"$f":"ANALYSE!K21","v":0},null,{"$f":"ANALYSE!L21","v":0},null,{"$f":"ANALYSE!M21","v":0},null,{"$f":"ANALYSE!N21","v":0},null,{"$f":"ANALYSE!O21","v":0},null,{"$f":"ANALYSE!P21","v":0},null,{"$f":"ANALYSE!Q21","v":0},null,{"$f":"ANALYSE!R21","v":0},null,{"$f":"ANALYSE!S21","v":0},null,{"$f":"ANALYSE!T21","v":0}]
["6- Améliorera le vivre-ensemble de l'organisation\n\n",{"$f":"ANALYSE!F21","v":0},null,{"$f":"ANALYSE!G22","v":0},null,{"$f":"ANALYSE!H22","v":0},null,{"$f":"ANALYSE!I22","v":0},null,{"$f":"ANALYSE!J22","v":0},null,{"$f":"ANALYSE!K22","v":0},null,{"$f":"ANALYSE!L22","v":0},null,{"$f":"ANALYSE!M22","v":0},null,{"$f":"ANALYSE!N22","v":0},null,{"$f":"ANALYSE!O22","v":0},null,{"$f":"ANALYSE!P22","v":0},null,{"$f":"ANALYSE!Q22","v":0},null,{"$f":"ANALYSE!R22","v":0},null,{"$f":"ANALYSE!S22","v":0},null,{"$f":"ANALYSE!T22","v":0}]
["7- Disposera des ressources nécessaires à toutes les étapes du projet\n\n",{"$f":"ANALYSE!F22","v":0},null,{"$f":"ANALYSE!G23","v":0},null,{"$f":"ANALYSE!H23","v":0},null,{"$f":"ANALYSE!I23","v":0},null,{"$f":"ANALYSE!J23","v":0},null,{"$f":"ANALYSE!K23","v":0},null,{"$f":"ANALYSE!L23","v":0},null,{"$f":"ANALYSE!M23","v":0},null,{"$f":"ANALYSE!N23","v":0},null,{"$f":"ANALYSE!O23","v":0},null,{"$f":"ANALYSE!P23","v":0},null,{"$f":"ANALYSE!Q23","v":0},null,{"$f":"ANALYSE!R23","v":0},null,{"$f":"ANALYSE!S23","v":0},null,{"$f":"ANALYSE!T23","v":0}]
["8- Possède un potentiel initial de succès\n\n",{"$f":"ANALYSE!F28","v":{"$error":"#DIV/0!"}},null,{"$f":"ANALYSE!G28","v":{"$error":"#DIV/0!"}},null,{"$f":"ANALYSE!H28","v":{"$error":"#DIV/0!"}},null,{"$f":"ANALYSE!I28","v":{"$error":"#DIV/0!"}},null,{"$f":"ANALYSE!J28","v":{"$error":"#DIV/0!"}},null,{"$f":"ANALYSE!K28","v":{"$error":"#DIV/0!"}},null,{"$f":"ANALYSE!L28","v":{"$error":"#DIV/0!"}},null,{"$f":"ANALYSE!M28","v":{"$error":"#DIV/0!"}},null,{"$f":"ANALYSE!N28","v":{"$error":"#DIV/0!"}},null,{"$f":"ANALYSE!O28","v":{"$error":"#DIV/0!"}},null,{"$f":"ANALYSE!P28","v":{"$error":"#DIV/0!"}},null,{"$f":"ANALYSE!Q28","v":{"$error":"#DIV/0!"}},null,{"$f":"ANALYSE!R28","v":{"$error":"#DIV/0!"}},null,{"$f":"ANALYSE!S28","v":{"$error":"#DIV/0!"}},null,{"$f":"ANALYSE!T28","v":{"$error":"#DIV/0!"}}]